Reaction Details
TargetCoagulation factor X
LigandBDBM50067530
Substrate/Competitorn/a
Meas. Tech.ChEMBL_48482 (CHEMBL662060)
Ki 4800±n/a nM
Citation Gabriel, BStubbs, MTBergner, AHauptmann, JBode, WStürzebecher, JMoroder, L Design of benzamidine-type inhibitors of factor Xa. J Med Chem41:4240-50 (1998) 
 
Coagulation factor X
Name:Coagulation factor X
Type:PROTEIN
Mol. Mass.:54498.45
Organism:Bos taurus
Description:ChEMBL_1364435
Residue:492
BDBM50067530
NameBDBM50067530
Synonyms:3-(4-Carbamimidoyl-phenyl)-2-[2-(4-cyano-benzenesulfonylamino)-acetylamino]-propionic acid ethyl ester | CHEMBL135198
TypeSmall organic molecule
Emp. Form.C21H23N5O5S
Mol. Mass.457.503
SMILESCCOC(=O)C(Cc1ccc(cc1)C(N)=N)NC(=O)CNS(=O)(=O)c1ccc(cc1)C#N