Reaction Details
TargetCoagulation factor X
LigandBDBM50067532
Substrate/Competitorn/a
Meas. Tech.ChEMBL_48811 (CHEMBL662834)
Ki 1800±n/a nM
Citation Gabriel, BStubbs, MTBergner, AHauptmann, JBode, WStürzebecher, JMoroder, L Design of benzamidine-type inhibitors of factor Xa. J Med Chem41:4240-50 (1998) 
 
Coagulation factor X
Name:Coagulation factor X
Type:Enzyme
Mol. Mass.:54726.60
Organism:Homo sapiens (Human)
Description:n/a
Residue:488
BDBM50067532
NameBDBM50067532
Synonyms:3-(3-Carbamimidoyl-phenyl)-2-[2-(toluene-4-sulfonylamino)-acetylamino]-propionic acid methyl ester | CHEMBL423699
TypeSmall organic molecule
Emp. Form.C20H24N4O5S
Mol. Mass.432.493
SMILESCOC(=O)C(Cc1cccc(c1)C(N)=N)NC(=O)CNS(=O)(=O)c1ccc(C)cc1