Reaction Details
TargetCoagulation factor X
LigandBDBM50067529
Substrate/Competitorn/a
Meas. Tech.ChEMBL_48811 (CHEMBL662834)
Ki 820.0±n/a nM
Citation Gabriel, BStubbs, MTBergner, AHauptmann, JBode, WStürzebecher, JMoroder, L Design of benzamidine-type inhibitors of factor Xa. J Med Chem41:4240-50 (1998) 
 
Coagulation factor X
Name:Coagulation factor X
Type:Enzyme
Mol. Mass.:54726.60
Organism:Homo sapiens (Human)
Description:n/a
Residue:488
BDBM50067529
NameBDBM50067529
Synonyms:2-[2-(4-Carbamimidoyl-benzenesulfonylamino)-acetylamino]-3-(3-carbamimidoyl-phenyl)-propionic acid ethyl ester | CHEMBL137780
TypeSmall organic molecule
Emp. Form.C21H26N6O5S
Mol. Mass.474.533
SMILESCCOC(=O)C(Cc1cccc(c1)C(N)=N)NC(=O)CNS(=O)(=O)c1ccc(cc1)C(N)=N