Reaction Details
TargetVitamin K-dependent protein C
LigandBDBM50067523
Substrate/Competitorn/a
Meas. Tech.ChEMBL_27848 (CHEMBL642273)
Ki 180000±n/a nM
Citation Gabriel, BStubbs, MTBergner, AHauptmann, JBode, WStürzebecher, JMoroder, L Design of benzamidine-type inhibitors of factor Xa. J Med Chem41:4240-50 (1998) 
 
Vitamin K-dependent protein C
Name:Vitamin K-dependent protein C
Type:Enzyme
Mol. Mass.:52067.73
Organism:Homo sapiens (Human)
Description:n/a
Residue:461
BDBM50067523
NameBDBM50067523
Synonyms:2-[2-(4-Carbamimidoyl-benzenesulfonylamino)-acetylamino]-3-(3-carbamimidoyl-phenyl)-propionic acid | CHEMBL133027
TypeSmall organic molecule
Emp. Form.C19H22N6O5S
Mol. Mass.446.48
SMILESNC(=N)c1ccc(cc1)S(=O)(=O)NCC(=O)NC(Cc1cccc(c1)C(N)=N)C(O)=O