Reaction Details
TargetAnionic trypsin
LigandBDBM50041224
Substrate/Competitorn/a
Meas. Tech.ChEMBL_212177 (CHEMBL815152)
Ki 620±n/a nM
Citation Gabriel, BStubbs, MTBergner, AHauptmann, JBode, WStürzebecher, JMoroder, L Design of benzamidine-type inhibitors of factor Xa. J Med Chem41:4240-50 (1998) 
 
Anionic trypsin
Name:Anionic trypsin
Type:PROTEIN
Mol. Mass.:26281.39
Organism:Bos taurus
Description:ChEMBL_212177
Residue:247
BDBM50041224
NameBDBM50041224
Synonyms:(R)-3-(7-Carbamimidoyl-naphthalen-2-yl)-2-{4-[(S)-1-(1-imino-ethyl)-pyrrolidin-3-yloxy]-phenyl}-propionic acid | CHEMBL19365
TypeSmall organic molecule
Emp. Form.C26H28N4O3
Mol. Mass.444.5255
SMILESCC(=N)N1CC[C@@H](C1)Oc1ccc(cc1)[C@@H](Cc1ccc2ccc(cc2c1)C(N)=N)C(O)=O