Reaction Details
TargetGlutamate receptor ionotropic, NMDA 2B
LigandBDBM50079387
Substrate/Competitorn/a
Meas. Tech.ChEMBL_1849360 (CHEMBL4349901)
Ki 13±n/a nM
Citation Wagner, MSchepmann, DAmetamey, SMWünsch, B Modification of the 4-phenylbutyl side chain of potent 3-benzazepine-based GluN2B receptor antagonists. Bioorg Med Chem27:3559-3567 (2019) 
 
Glutamate receptor ionotropic, NMDA 2B
Name:Glutamate receptor ionotropic, NMDA 2B
Type:PROTEIN
Mol. Mass.:166375.46
Organism:Homo sapiens (Human)
Description:ChEMBL_1438829
Residue:1484
BDBM50079387
NameBDBM50079387
Synonyms:1-(4-Chloro-phenyl)-2-[4-(4-fluoro-benzyl)-piperidin-1-yl]-ethanol Eliprodil
TypeSmall organic molecule
Emp. Form.C20H23ClFNO
Mol. Mass.347.854
SMILESOC(CN1CCC(Cc2ccc(F)cc2)CC1)c1ccc(Cl)cc1