Reaction Details
TargetProthrombin
LigandBDBM50067795
Substrate/Competitorn/a
Meas. Tech.ChEMBL_208516 (CHEMBL817242)
Ki 0.35±n/a nM
Citation Sanderson, PELyle, TACutrona, KJDyer, DLDorsey, BDMcDonough, CMNaylor-Olsen, AMChen, IWChen, ZCook, JJCooper, CMGardell, SJHare, TRKrueger, JALewis, SDLin, JHLucas, BJLyle, EALynch, JJStranieri, MTVastag, KYan, YShafer, JAVacca, JP Efficacious, orally bioavailable thrombin inhibitors based on 3-aminopyridinone or 3-aminopyrazinone acetamide peptidomimetic templates. J Med Chem41:4466-74 (1998) 
 
Prothrombin
Name:Prothrombin
Type:Protein
Mol. Mass.:70029.57
Organism:Homo sapiens (Human)
Description:P00734
Residue:622
BDBM50067795
NameBDBM50067795
Synonyms:CHEMBL138855 | N-(6-Amino-2,4-dimethyl-pyridin-3-ylmethyl)-2-(6-methyl-2-oxo-3-phenethylamino-2H-pyrazin-1-yl)-acetamide
TypeSmall organic molecule
Emp. Form.C23H28N6O2
Mol. Mass.420.5074
SMILESCc1cc(N)nc(C)c1CNC(=O)Cn1c(C)cnc(NCCc2ccccc2)c1=O