Reaction Details
TargetBeta-lactamase
LigandBDBM50067884
Substrate/Competitorn/a
Meas. Tech.ChEMBL_35528 (CHEMBL649554)
Ki>100000±n/a nM
Citation Weston, GSBlázquez, JBaquero, FShoichet, BK Structure-based enhancement of boronic acid-based inhibitors of AmpC beta-lactamase. J Med Chem41:4577-86 (1998) 
 
Beta-lactamase
Name:Beta-lactamase
Type:Protien
Mol. Mass.:41561.62
Organism:Escherichia coli
Description:P00811
Residue:377
BDBM50067884
NameBDBM50067884
Synonyms:1-BUTANE BORONIC ACID Butyl boronic acid CHEMBL31962
TypeSmall organic molecule
Emp. Form.C4H11BO2
Mol. Mass.101.94
SMILESCCCCB(O)O