Reaction Details
TargetBeta-lactamase
LigandBDBM50067907
Substrate/Competitorn/a
Meas. Tech.ChEMBL_35528 (CHEMBL649554)
Ki 780.0±n/a nM
Citation Weston, GSBlázquez, JBaquero, FShoichet, BK Structure-based enhancement of boronic acid-based inhibitors of AmpC beta-lactamase. J Med Chem41:4577-86 (1998) 
 
Beta-lactamase
Name:Beta-lactamase
Type:Protien
Mol. Mass.:41561.62
Organism:Escherichia coli
Description:P00811
Residue:377
BDBM50067907
NameBDBM50067907
Synonyms:CHEMBL342173 | benzo[b]thiophene3-boronic acid
TypeSmall organic molecule
Emp. Form.C8H7BO2S
Mol. Mass.178.016
SMILESOB(O)c1csc2ccccc12