Reaction Details
TargetBeta-lactamase
LigandBDBM50067911
Substrate/Competitorn/a
Meas. Tech.ChEMBL_35528 (CHEMBL649554)
Ki 500±n/a nM
Citation Weston, GSBlázquez, JBaquero, FShoichet, BK Structure-based enhancement of boronic acid-based inhibitors of AmpC beta-lactamase. J Med Chem41:4577-86 (1998) 
 
Beta-lactamase
Name:Beta-lactamase
Type:Protien
Mol. Mass.:41561.62
Organism:Escherichia coli
Description:P00811
Residue:377
BDBM50067911
NameBDBM50067911
Synonyms:4-methylthiophene 2-boronic acid | CHEMBL334931
TypeSmall organic molecule
Emp. Form.C5H7BO2S
Mol. Mass.141.984
SMILESCc1csc(c1)B(O)O