Reaction Details
TargetPhosphatidylinositol 4,5-bisphosphate 3-kinase catalytic subunit delta isoform
LigandBDBM50193031
Substrate/Competitorn/a
Meas. Tech.ChEMBL_1850453 (CHEMBL4351077)
IC50 2.0±n/a nM
Citation Perry, MWDAbdulai, RMogemark, MPetersen, JThomas, MJValastro, BWestin Eriksson, A Evolution of PI3K? and ? Inhibitors for Inflammatory and Autoimmune Diseases. J Med Chem62:4783-4814 (2019) 
 
Phosphatidylinositol 4,5-bisphosphate 3-kinase catalytic subunit delta isoform
Name:Phosphatidylinositol 4,5-bisphosphate 3-kinase catalytic subunit delta isoform
Type:Enzyme Subunit
Mol. Mass.:119489.41
Organism:Homo sapiens (Human)
Description:O00329
Residue:1044
BDBM50193031
NameBDBM50193031
Synonyms:CHEMBL3959351 | US11155556, No. 12
TypeSmall organic molecule
Emp. Form.C25H28N6O4S
Mol. Mass.508.593
SMILESCN1c2ccc(C)cc2C(=O)N(C)c2cnc(Nc3cccc(c3)S(=O)(=O)N3CCC(O)CC3)nc12