Reaction Details
TargetPhosphatidylinositol 4,5-bisphosphate 3-kinase catalytic subunit delta isoform
LigandBDBM50512872
Substrate/Competitorn/a
Meas. Tech.ChEMBL_1850453 (CHEMBL4351077)
IC50 0.200000±n/a nM
Citation Perry, MWDAbdulai, RMogemark, MPetersen, JThomas, MJValastro, BWestin Eriksson, A Evolution of PI3K? and ? Inhibitors for Inflammatory and Autoimmune Diseases. J Med Chem62:4783-4814 (2019) 
 
Phosphatidylinositol 4,5-bisphosphate 3-kinase catalytic subunit delta isoform
Name:Phosphatidylinositol 4,5-bisphosphate 3-kinase catalytic subunit delta isoform
Type:Enzyme Subunit
Mol. Mass.:119489.41
Organism:Homo sapiens (Human)
Description:O00329
Residue:1044
BDBM50512872
NameBDBM50512872
Synonyms:CHEMBL4470131
TypeSmall organic molecule
Emp. Form.C20H16ClN7
Mol. Mass.389.841
SMILESC[C@H](Nc1ncnc(N)c1C#N)c1cc2ncc(Cl)n2cc1-c1ccccc1