Reaction Details
TargetPhosphatidylinositol 4,5-bisphosphate 3-kinase catalytic subunit delta isoform
LigandBDBM50512880
Substrate/Competitorn/a
Meas. Tech.ChEMBL_1850502 (CHEMBL4351126)
IC50<0.1±n/a nM
CommentsZero 12/22/2021
Citation Perry, MWDAbdulai, RMogemark, MPetersen, JThomas, MJValastro, BWestin Eriksson, A Evolution of PI3K? and ? Inhibitors for Inflammatory and Autoimmune Diseases. J Med Chem62:4783-4814 (2019) 
 
Phosphatidylinositol 4,5-bisphosphate 3-kinase catalytic subunit delta isoform
Name:Phosphatidylinositol 4,5-bisphosphate 3-kinase catalytic subunit delta isoform
Type:Enzyme Subunit
Mol. Mass.:119489.41
Organism:Homo sapiens (Human)
Description:O00329
Residue:1044
BDBM50512880
NameBDBM50512880
Synonyms:CHEMBL4468379
TypeSmall organic molecule
Emp. Form.C20H16ClN7O2S
Mol. Mass.453.905
SMILESC[C@H](Nc1ncnc2[nH]cnc12)C1=Nc2cccc(Cl)c2S(=O)(=O)N1c1ccccc1