Reaction Details
TargetCoagulation factor X
LigandBDBM50068280
Substrate/Competitorn/a
Meas. Tech.ChEMBL_48639 (CHEMBL659619)
IC50>33000±n/a nM
Citation Combrink, KDGülgeze, HBMeanwell, NAPearce, BCZulan, PBisacchi, GSRoberts, DGStanley, PSeiler, SM 1,2-Benzisothiazol-3-one 1,1-dioxide inhibitors of human mast cell tryptase. J Med Chem41:4854-60 (1998) 
 
Coagulation factor X
Name:Coagulation factor X
Type:Enzyme
Mol. Mass.:54726.60
Organism:Homo sapiens (Human)
Description:n/a
Residue:488
BDBM50068280
NameBDBM50068280
Synonyms:5-Benzyloxycarbonylamino-pentanoic acid 1,1,3-trioxo-1,3-dihydro-1lambda*6*-benzo[d]isothiazol-2-ylmethyl ester | CHEMBL341885
TypeSmall organic molecule
Emp. Form.C21H22N2O7S
Mol. Mass.446.474
SMILESO=C(CCCCNC(=O)OCc1ccccc1)OCN1C(=O)c2ccccc2S1(=O)=O