Reaction Details
TargetProthrombin
LigandBDBM50068284
Substrate/Competitorn/a
Meas. Tech.ChEMBL_208122 (CHEMBL818152)
IC50>33000±n/a nM
Citation Combrink, KDGülgeze, HBMeanwell, NAPearce, BCZulan, PBisacchi, GSRoberts, DGStanley, PSeiler, SM 1,2-Benzisothiazol-3-one 1,1-dioxide inhibitors of human mast cell tryptase. J Med Chem41:4854-60 (1998) 
 
Prothrombin
Name:Prothrombin
Type:Protein
Mol. Mass.:70029.57
Organism:Homo sapiens (Human)
Description:P00734
Residue:622
BDBM50068284
NameBDBM50068284
Synonyms:3-Benzyloxycarbonylamino-propionic acid 1,1,3-trioxo-1,3-dihydro-1lambda*6*-benzo[d]isothiazol-2-ylmethyl ester | CHEMBL344560
TypeSmall organic molecule
Emp. Form.C19H18N2O7S
Mol. Mass.418.42
SMILESO=C(CCNC(=O)OCc1ccccc1)OCN1C(=O)c2ccccc2S1(=O)=O