Reaction Details
TargetNeutrophil elastase
LigandBDBM50068298
Substrate/Competitorn/a
Meas. Tech.ChEMBL_96630 (CHEMBL705702)
IC50 2660±n/a nM
Citation Combrink, KDGülgeze, HBMeanwell, NAPearce, BCZulan, PBisacchi, GSRoberts, DGStanley, PSeiler, SM 1,2-Benzisothiazol-3-one 1,1-dioxide inhibitors of human mast cell tryptase. J Med Chem41:4854-60 (1998) 
 
Neutrophil elastase
Name:Neutrophil elastase
Type:Enzyme
Mol. Mass.:28532.38
Organism:Homo sapiens (Human)
Description:P08246
Residue:267
BDBM50068298
NameBDBM50068298
Synonyms:4-Benzyloxycarbonylamino-benzoic acid 1,1,3-trioxo-1,3-dihydro-1lambda*6*-benzo[d]isothiazol-2-ylmethyl ester | CHEMBL144342
TypeSmall organic molecule
Emp. Form.C23H18N2O7S
Mol. Mass.466.463
SMILESO=C(Nc1ccc(cc1)C(=O)OCN1C(=O)c2ccccc2S1(=O)=O)OCc1ccccc1