Reaction Details
TargetNuclear receptor subfamily 1 group I member 3
LigandBDBM50030476
Substrate/Competitorn/a
Meas. Tech.ChEMBL_1853466 (CHEMBL4354090)
EC50 570±n/a nM
Citation Liang, DLi, LLynch, CMackowiak, BHedrich, WDAi, YYin, YHeyward, SXia, MWang, HXue, F Human constitutive androstane receptor agonist DL5016: A novel sensitizer for cyclophosphamide-based chemotherapies. Eur J Med Chem179:84-99 (2019) 
 
Nuclear receptor subfamily 1 group I member 3
Name:Nuclear receptor subfamily 1 group I member 3
Type:PROTEIN
Mol. Mass.:39953.17
Organism:Homo sapiens (Human)
Description:ChEMBL_1434936
Residue:352
BDBM50030476
NameBDBM50030476
Synonyms:CHEMBL458603
TypeSmall organic molecule
Emp. Form.C19H12Cl3N3OS
Mol. Mass.436.742
SMILESClc1ccc(cc1)-c1nc2sccn2c1\C=N\OCc1ccc(Cl)c(Cl)c1