Reaction Details
TargetChymase
LigandBDBM50068894
Substrate/Competitorn/a
Meas. Tech.ChEBML_49442
Ki 5.6±n/a nM
Citation Eda, MAshimori, AAkahoshi, FYoshimura, TInoue, YFukaya, CNakajima, MFukuyama, HImada, TTakai, SShiota, NMiyazaki, MNakamura, N Peptidyl human heart chymase inhibitors. 1. Synthesis and inhibitory activity of difluoromethylene ketone derivatives bearing P' binding subsites. Bioorg Med Chem Lett8:913-8 (1999) Chymase
Name:Chymase
Type:Enzyme
Mol. Mass.:27340.12
Organism:Homo sapiens (Human)
Description:n/a
Residue:247
BDBM50068894
NameBDBM50068894
Synonyms:3-(4-{[(S)-1-((S)-2-tert-Butoxycarbonylamino-3-methyl-butyryl)-pyrrolidine-2-carbonyl]-amino}-2,2-difluoro-3-oxo-5-phenyl-pentanoylamino)-benzoic acid CHEMBL287318
TypeSmall organic molecule
Emp. Form.C33H40F2N4O8
Mol. Mass.658.6895
SMILESCC(C)[C@H](NC(=O)OC(C)(C)C)C(=O)N1CCC[C@H]1C(=O)NC(Cc1ccccc1)C(=O)C(F)(F)C(=O)Nc1cccc(c1)C(O)=O