Reaction Details
TargetChymase
LigandBDBM50068917
Substrate/Competitorn/a
Meas. Tech.ChEBML_49443
Ki 6±n/a nM
Citation Eda, MAshimori, AAkahoshi, FYoshimura, TInoue, YFukaya, CNakajima, MFukuyama, HImada, TTakai, SShiota, NMiyazaki, MNakamura, N Peptidyl human heart chymase inhibitors. 2. Discovery of highly selective difluoromethylene ketone derivatives with Glu at P3 site. Bioorg Med Chem Lett8:919-24 (1999) Chymase
Name:Chymase
Type:Enzyme
Mol. Mass.:27340.12
Organism:Homo sapiens (Human)
Description:n/a
Residue:247
BDBM50068917
NameBDBM50068917
Synonyms:5-(4-{[(S)-1-(2-tert-Butoxycarbonylamino-4-carboxy-butyryl)-pyrrolidine-2-carbonyl]-amino}-2,2-difluoro-3-oxo-5-phenyl-pentanoylamino)-thiophene-3-carboxylic acid | CHEMBL355132
TypeSmall organic molecule
Emp. Form.C31H36F2N4O10S
Mol. Mass.694.7
SMILESCC(C)(C)OC(=O)NC(CCC(O)=O)C(=O)N1CCC[C@H]1C(=O)NC(Cc1ccccc1)C(=O)C(F)(F)C(=O)Nc1cc(cs1)C(O)=O