Reaction Details
TargetLactoylglutathione lyase
LigandBDBM50069027
Substrate/Competitorn/a
Meas. Tech.ChEBML_71304
IC50 1624600±n/a nM
Citation Ly, HDClugston, SLSampson, PBHonek, JF Syntheses and kinetic evaluation of hydroxamate-based peptide inhibitors of glyoxalase I. Bioorg Med Chem Lett8:705-10 (1999) Lactoylglutathione lyase
Name:Lactoylglutathione lyase
Type:Enzyme
Mol. Mass.:20772.95
Organism:Homo sapiens (Human)
Description:Q04760
Residue:184
BDBM50069027
NameBDBM50069027
Synonyms:2-Amino-4-[1-(ethoxycarbonylmethyl-carbamoyl)-3-hydroxycarbamoyl-propylcarbamoyl]-butyric acid anion | CHEMBL161181
TypeSmall organic molecule
Emp. Form.C14H24N4O8
Mol. Mass.376.3624
SMILESCCOC(=O)CNC(=O)C(CCC(=O)NO)NC(=O)CCC([NH3+])C([O-])=O