Reaction Details
TargetAndrogen receptor
LigandBDBM50069071
Substrate/Competitorn/a
Meas. Tech.ChEMBL_36133 (CHEMBL648322)
Ki 5±n/a nM
Citation Edwards, JPWest, SJPooley, CLMarschke, KBFarmer, LJJones, TK New nonsteroidal androgen receptor modulators based on 4-(trifluoromethyl)-2(1H)-pyrrolidino[3,2-g] quinolinone. Bioorg Med Chem Lett8:745-50 (1999) Androgen receptor
Name:Androgen receptor
Type:Receptor
Mol. Mass.:99185.27
Organism:Homo sapiens (Human)
Description:CHO cells were stably transfected with human AR gene.
Residue:920
BDBM50069071
NameBDBM50069071
Synonyms:(5bR,9aR)-4-Trifluoromethyl-1,5b,6,7,8,9,9a,10-octahydro-pyrido[2,3-b]carbazol-2-one | CHEMBL350932
TypeSmall organic molecule
Emp. Form.C16H15F3N2O
Mol. Mass.308.2983
SMILESFC(F)(F)c1cc(=O)[nH]c2cc3N[C@@H]4CCCC[C@@H]4c3cc12