Reaction Details
TargetEstrogen receptor beta
LigandBDBM50069069
Substrate/Competitorn/a
Meas. Tech.ChEMBL_65906 (CHEMBL679350)
IC50>10000±n/a nM
Citation Edwards, JPWest, SJPooley, CLMarschke, KBFarmer, LJJones, TK New nonsteroidal androgen receptor modulators based on 4-(trifluoromethyl)-2(1H)-pyrrolidino[3,2-g] quinolinone. Bioorg Med Chem Lett8:745-50 (1999) Estrogen receptor beta
Name:Estrogen receptor beta
Synonyms:Estrogen receptor
Type:n/a
Mol. Mass.:n/a
Description:ASSAY_ID of ChEMBL is 99778
Components:This complex has 2 components.
Component 1
Name:Estrogen receptor beta
Type:Protein
Mol. Mass.:59238.43
Organism:Homo sapiens (Human)
Description:Q92731
Residue:530
Component 2
Name:Estrogen receptor
Synonyms:ER ESR ESR1_HUMAN Estrogen receptor Estrogen receptor (ER-alpha) Estrogen receptor alpha (ER) Nuclear receptor subfamily 3 group A member 1
Type:Protein
Mol. Mass.:66230.44
Organism:Homo sapiens (Human)
Description:P03372
Residue:595
BDBM50069069
NameBDBM50069069
Synonyms:(5bR,9aR)-1-Methyl-4-trifluoromethyl-1,5b,6,7,8,9,9a,10-octahydro-pyrido[2,3-b]carbazol-2-one | CHEMBL163425
TypeSmall organic molecule
Emp. Form.C17H17F3N2O
Mol. Mass.322.3249
SMILESCn1c2cc3N[C@@H]4CCCC[C@@H]4c3cc2c(cc1=O)C(F)(F)F