Reaction Details
TargetGlucocorticoid receptor
LigandBDBM50069071
Substrate/Competitorn/a
Meas. Tech.ChEBML_71098
IC50 5800±n/a nM
Citation Edwards, JPWest, SJPooley, CLMarschke, KBFarmer, LJJones, TK New nonsteroidal androgen receptor modulators based on 4-(trifluoromethyl)-2(1H)-pyrrolidino[3,2-g] quinolinone. Bioorg Med Chem Lett8:745-50 (1999) Glucocorticoid receptor
Name:Glucocorticoid receptor
Type:Enzyme
Mol. Mass.:85656.87
Organism:Homo sapiens (Human)
Description:P04150
Residue:777
BDBM50069071
NameBDBM50069071
Synonyms:(5bR,9aR)-4-Trifluoromethyl-1,5b,6,7,8,9,9a,10-octahydro-pyrido[2,3-b]carbazol-2-one | CHEMBL350932
TypeSmall organic molecule
Emp. Form.C16H15F3N2O
Mol. Mass.308.2983
SMILESFC(F)(F)c1cc(=O)[nH]c2cc3N[C@@H]4CCCC[C@@H]4c3cc12