Reaction Details
TargetMineralocorticoid receptor
LigandBDBM50069069
Substrate/Competitorn/a
Meas. Tech.ChEBML_123677
IC50 2900±n/a nM
Citation Edwards, JPWest, SJPooley, CLMarschke, KBFarmer, LJJones, TK New nonsteroidal androgen receptor modulators based on 4-(trifluoromethyl)-2(1H)-pyrrolidino[3,2-g] quinolinone. Bioorg Med Chem Lett8:745-50 (1999) Mineralocorticoid receptor
Name:Mineralocorticoid receptor
Type:Enzyme
Mol. Mass.:107076.42
Organism:Homo sapiens (Human)
Description:P08235
Residue:984
BDBM50069069
NameBDBM50069069
Synonyms:(5bR,9aR)-1-Methyl-4-trifluoromethyl-1,5b,6,7,8,9,9a,10-octahydro-pyrido[2,3-b]carbazol-2-one | CHEMBL163425
TypeSmall organic molecule
Emp. Form.C17H17F3N2O
Mol. Mass.322.3249
SMILESCn1c2cc3N[C@@H]4CCCC[C@@H]4c3cc2c(cc1=O)C(F)(F)F