Reaction Details
TargetCoagulation factor VII
LigandBDBM50069153
Substrate/Competitorn/a
Meas. Tech.ChEBML_48467
Ki 14000±n/a nM
Citation Duncia, JVSantella, JBHigley, CAVanAtten, MKWeber, PCAlexander, RSKettner, CAPruitt, JRLiauw, AYQuan, MLKnabb, RMWexler, RR Pyrazoles, 1,2,4-triazoles, and tetrazoles as surrogates for cis-amide bonds in boronate ester thrombin inhibitors. Bioorg Med Chem Lett8:775-80 (1999) Coagulation factor VII
Name:Coagulation factor VII
Type:Enzyme
Mol. Mass.:51599.89
Organism:Homo sapiens (Human)
Description:n/a
Residue:466
BDBM50069153
NameBDBM50069153
Synonyms:(1-{[(R)-5-Amino-1-((1S,2S,6R,8S)-2,9,9-trimethyl-3,5-dioxa-4-bora-tricyclo[6.1.1.0*2,6*]dec-4-yl)-pentylcarbamoyl]-methyl}-5-benzyl-1H-[1,2,4]triazol-3-yl)-acetic acid methyl ester | CHEMBL2373555
TypeSmall organic molecule
Emp. Form.C29H42BN5O5
Mol. Mass.551.485
SMILES[H][C@@]12C[C@@]([H])(C1(C)C)[C@]1(C)OB(O[C@]1([H])C2)[C@H](CCCCN)NC(=O)Cn1nc(CC(=O)OC)nc1Cc1ccccc1