Reaction Details
TargetCoagulation factor VII
LigandBDBM50069157
Substrate/Competitorn/a
Meas. Tech.ChEBML_48467
Ki 41.0±n/a nM
Citation Duncia, JVSantella, JBHigley, CAVanAtten, MKWeber, PCAlexander, RSKettner, CAPruitt, JRLiauw, AYQuan, MLKnabb, RMWexler, RR Pyrazoles, 1,2,4-triazoles, and tetrazoles as surrogates for cis-amide bonds in boronate ester thrombin inhibitors. Bioorg Med Chem Lett8:775-80 (1999) Coagulation factor VII
Name:Coagulation factor VII
Type:Enzyme
Mol. Mass.:51599.89
Organism:Homo sapiens (Human)
Description:n/a
Residue:466
BDBM50069157
NameBDBM50069157
Synonyms:CHEMBL2373401 | N-[(R)-5-Amino-1-((1S,2S,6R,8S)-2,9,9-trimethyl-3,5-dioxa-4-bora-tricyclo[6.1.1.0*2,6*]dec-4-yl)-pentyl]-2-(3,5-dibenzyl-[1,2,4]triazol-1-yl)-acetamide
TypeSmall organic molecule
Emp. Form.C33H44BN5O3
Mol. Mass.569.545
SMILES[H][C@@]12C[C@@]([H])(C1(C)C)[C@]1(C)OB(O[C@]1([H])C2)[C@H](CCCCN)NC(=O)Cn1nc(Cc2ccccc2)nc1Cc1ccccc1