Reaction Details
TargetCoagulation factor X
LigandBDBM50069154
Substrate/Competitorn/a
Meas. Tech.ChEMBL_69689 (CHEMBL682025)
Ki 5.50±n/a nM
Citation Duncia, JVSantella, JBHigley, CAVanAtten, MKWeber, PCAlexander, RSKettner, CAPruitt, JRLiauw, AYQuan, MLKnabb, RMWexler, RR Pyrazoles, 1,2,4-triazoles, and tetrazoles as surrogates for cis-amide bonds in boronate ester thrombin inhibitors. Bioorg Med Chem Lett8:775-80 (1999) Coagulation factor X
Name:Coagulation factor X
Type:Enzyme
Mol. Mass.:54726.60
Organism:Homo sapiens (Human)
Description:n/a
Residue:488
BDBM50069154
NameBDBM50069154
Synonyms:3-(1-{[(R)-5-Amino-1-((1S,2S,6R,8S)-2,9,9-trimethyl-3,5-dioxa-4-bora-tricyclo[6.1.1.0*2,6*]dec-4-yl)-pentylcarbamoyl]-methyl}-5-benzyl-1H-[1,2,4]triazol-3-yl)-propionic acid tert-butyl ester | CHEMBL2373367
TypeSmall organic molecule
Emp. Form.C33H50BN5O5
Mol. Mass.607.592
SMILES[H][C@@]12C[C@@]([H])(C1(C)C)[C@]1(C)OB(O[C@]1([H])C2)[C@H](CCCCN)NC(=O)Cn1nc(CCC(=O)OC(C)(C)C)nc1Cc1ccccc1