Reaction Details
TargetCoagulation factor X
LigandBDBM50069173
Substrate/Competitorn/a
Meas. Tech.ChEMBL_69689 (CHEMBL682025)
Ki>6000±n/a nM
Citation Duncia, JVSantella, JBHigley, CAVanAtten, MKWeber, PCAlexander, RSKettner, CAPruitt, JRLiauw, AYQuan, MLKnabb, RMWexler, RR Pyrazoles, 1,2,4-triazoles, and tetrazoles as surrogates for cis-amide bonds in boronate ester thrombin inhibitors. Bioorg Med Chem Lett8:775-80 (1999) Coagulation factor X
Name:Coagulation factor X
Type:Enzyme
Mol. Mass.:54726.60
Organism:Homo sapiens (Human)
Description:n/a
Residue:488
BDBM50069173
NameBDBM50069173
Synonyms:CHEMBL2373403 | N-[(R)-5-Amino-1-((1S,2S,6R,8S)-2,9,9-trimethyl-3,5-dioxa-4-bora-tricyclo[6.1.1.0*2,6*]dec-4-yl)-pentyl]-2-[3-cyanomethyl-5-(3-nitro-benzyl)-[1,2,4]triazol-1-yl]-acetamide
TypeSmall organic molecule
Emp. Form.C28H38BN7O5
Mol. Mass.563.456
SMILES[H][C@@]12C[C@@]([H])(C1(C)C)[C@]1(C)OB(O[C@]1([H])C2)[C@H](CCCCN)NC(=O)Cn1nc(CC#N)nc1Cc1cccc(c1)[N+]([O-])=O