Reaction Details
TargetProthrombin
LigandBDBM50069189
Substrate/Competitorn/a
Meas. Tech.ChEBML_208320
Ki 0.330000±n/a nM
Citation Sanderson, PECutrona, KJDorsey, BDDyer, DLMcDonough, CMNaylor-Olsen, AMChen, IWChen, ZCook, JJGardell, SJKrueger, JALewis, SDLin, JHLucas, BJLyle, EALynch, JJStranieri, MTVastag, KShafer, JAVacca, JP L-374,087, an efficacious, orally bioavailable, pyridinone acetamide thrombin inhibitor. Bioorg Med Chem Lett8:817-22 (1999) Prothrombin
Name:Prothrombin
Type:Protein
Mol. Mass.:70029.57
Organism:Homo sapiens (Human)
Description:P00734
Residue:622
BDBM50069189
NameBDBM50069189
Synonyms:CHEMBL353431 | N-(6-Amino-2,4-dimethyl-pyridin-3-ylmethyl)-2-(6-methyl-2-oxo-3-phenylmethanesulfonylamino-2H-pyridin-1-yl)-acetamide
TypeSmall organic molecule
Emp. Form.C23H27N5O4S
Mol. Mass.469.557
SMILESCc1cc(N)nc(C)c1CNC(=O)Cn1c(C)ccc(NS(=O)(=O)Cc2ccccc2)c1=O