Reaction Details
TargetGag-Pol polyprotein [489-587]
LigandBDBM50069204
Substrate/Competitorn/a
Meas. Tech.ChEBML_80092
Ki 0.059000±n/a nM
Citation Patel, MBacheler, LTRayner, MMCordova, BCKlabe, RMErickson-Viitanen, SSeitz, SP The synthesis and evaluation of cyclic ureas as HIV protease inhibitors: modifications of the P1/P1' residues. Bioorg Med Chem Lett8:823-8 (1999) Gag-Pol polyprotein [489-587]
Name:Gag-Pol polyprotein [489-587]
Type:Enzyme Subunit
Mol. Mass.:10781.16
Organism:Human immunodeficiency virus type 1
Description:P04585[489-587]
Residue:99
BDBM50069204
NameBDBM50069204
Synonyms:(4R,5S,6S,7R)-5,6-Dihydroxy-1,3-bis-[3-(1H-pyrazol-3-yl)-benzyl]-4,7-bis-[4-(pyridin-3-ylmethoxy)-benzyl]-[1,3]diazepan-2-one | CHEMBL353484
TypeSmall organic molecule
Emp. Form.C51H48N8O5
Mol. Mass.852.9774
SMILESO[C@@H]1[C@@H](O)[C@@H](Cc2ccc(OCc3cccnc3)cc2)N(Cc2cccc(c2)-c2cc[nH]n2)C(=O)N(Cc2cccc(c2)-c2cc[nH]n2)[C@@H]1Cc1ccc(OCc2cccnc2)cc1