Reaction Details
TargetAcetylcholinesterase
LigandBDBM50069244
Substrate/Competitorn/a
Meas. Tech.ChEMBL_27796 (CHEMBL637623)
Ki 5500±n/a nM
Citation Perola, ECellai, LBrufani, M Synthesis and activity studies of N-[omega-N'-(adamant-1'-yl)aminoalkyl]- 2-(4'-dimethylaminophenyl)acetamides: in the search of selective inhibitors for the different molecular forms of acetylcholinesterase. Bioorg Med Chem Lett8:575-80 (1999) Acetylcholinesterase
Name:Acetylcholinesterase
Type:n/a
Mol. Mass.:65900.74
Organism:Tetronarce californica (Pacific electric ray) (Torpedo californica)
Description:P04058
Residue:586
BDBM50069244
NameBDBM50069244
Synonyms:CHEMBL357551 | N-[8-(Adamantan-1-ylamino)-octyl]-2-(4-dimethylamino-phenyl)-acetamide
TypeSmall organic molecule
Emp. Form.C28H45N3O
Mol. Mass.439.6764
SMILESCN(C)c1ccc(CC(=O)NCCCCCCCCNC23CC4CC(CC(C4)C2)C3)cc1