Reaction Details
TargetAcetylcholinesterase
LigandBDBM50069243
Substrate/Competitorn/a
Meas. Tech.ChEMBL_27790 (CHEMBL637617)
IC50 5300±n/a nM
Citation Perola, ECellai, LBrufani, M Synthesis and activity studies of N-[omega-N'-(adamant-1'-yl)aminoalkyl]- 2-(4'-dimethylaminophenyl)acetamides: in the search of selective inhibitors for the different molecular forms of acetylcholinesterase. Bioorg Med Chem Lett8:575-80 (1999) Acetylcholinesterase
Name:Acetylcholinesterase
Type:n/a
Mol. Mass.:65900.74
Organism:Tetronarce californica (Pacific electric ray) (Torpedo californica)
Description:P04058
Residue:586
BDBM50069243
NameBDBM50069243
Synonyms:CHEMBL153934 | N-[10-(Adamantan-1-ylamino)-decyl]-2-(4-dimethylamino-phenyl)-acetamide
TypeSmall organic molecule
Emp. Form.C30H49N3O
Mol. Mass.467.7296
SMILESCN(C)c1ccc(CC(=O)NCCCCCCCCCCNC23CC4CC(CC(C4)C2)C3)cc1