Reaction Details
TargetTyrosine-protein kinase ZAP-70
LigandBDBM50069336
Substrate/Competitorn/a
Meas. Tech.ChEBML_219331
IC50 30±n/a nM
Citation Révész, LBonne, FManning, UZuber, JF Solid phase synthesis of a biased mini tetrapeptoid-library for the discovery of monodentate ITAM mimics as ZAP-70 inhibitors. Bioorg Med Chem Lett8:405-8 (1999) Tyrosine-protein kinase ZAP-70
Name:Tyrosine-protein kinase ZAP-70
Type:Enzyme
Mol. Mass.:69881.61
Organism:Homo sapiens (Human)
Description:ZAP-70 SH2 domain was expressed and purified from E. coli using O-phospho-L-tyrosine-agarose column.
Residue:619
BDBM50069336
NameBDBM50069336
Synonyms:CHEMBL439120 NQLPpYNELNLGRREEpYDVLD
TypeSmall organic molecule
Emp. Form.C106H166N30O43P2
Mol. Mass.2610.575
SMILESCC(C)C[C@H](NC(=O)[C@H](CC(N)=O)NC(=O)[C@H](CC(C)C)NC(=O)[C@H](CCC(O)=O)NC(=O)[C@H](CC(N)=O)NC(=O)[C@H](Cc1ccc(OP(O)(O)=O)cc1)NC(=O)[C@@H]1CCCN1C(=O)[C@H](CC(C)C)NC(=O)[C@H](CCC(N)=O)NC(=O)[C@@H](N)CC(N)=O)C(=O)NCC(=O)N[C@@H](CCCNC(N)=N)C(=O)N[C@@H](CCCNC(N)=N)C(=O)N[C@@H](CCC(O)=O)C(=O)N[C@@H](CCC(O)=O)C(=O)N[C@@H](Cc1ccc(OP(O)(O)=O)cc1)C(=O)N[C@@H](CC(O)=O)C(=O)N[C@@H](C(C)C)C(=O)N[C@@H](CC(C)C)C(=O)N[C@@H](CC(O)=O)C(O)=O