Reaction Details
TargetNeuropeptide Y receptor type 1
LigandBDBM50069421
Substrate/Competitorn/a
Meas. Tech.ChEBML_144140
Ki 29±n/a nM
Citation Zimmerman, DMCantrell, BESmith, ECNixon, JABruns, RFGitter, BHipskind, PAOrnstein, PLZarrinmayeh, HBritton, TCSchober, DAGehlert, DR Structure-activity relationships of a series of 1-substituted-4-methylbenzimidazole neuropeptide Y-1 receptor antagonists. Bioorg Med Chem Lett8:473-6 (1999) Neuropeptide Y receptor type 1
Name:Neuropeptide Y receptor type 1
Type:Enzyme Catalytic Domain
Mol. Mass.:44399.07
Organism:Homo sapiens (Human)
Description:NPY-Y1 NPY1R HUMAN::P25929
Residue:384
BDBM50069421
NameBDBM50069421
Synonyms:2-(4-Chloro-phenoxymethyl)-4-methyl-1-[3-(1-phenethyl-piperidin-4-yl)-propyl]-1H-benzoimidazole | CHEMBL421770
TypeSmall organic molecule
Emp. Form.C31H36ClN3O
Mol. Mass.502.09
SMILESCc1cccc2n(CCCC3CCN(CCc4ccccc4)CC3)c(COc3ccc(Cl)cc3)nc12