Reaction Details
TargetEstrogen receptor
LigandBDBM50514279
Substrate/Competitorn/a
Meas. Tech.ChEMBL_1855957 (CHEMBL4356686)
IC50 1.9±n/a nM
Citation Lu, YGutgesell, LMXiong, RZhao, JLi, YRosales, CIHollas, MShen, ZGordon-Blake, JDye, KWang, YLee, SChen, HHe, DDubrovyskyii, OZhao, HHuang, FLasek, AWTonetti, DAThatcher, GRJ Design and Synthesis of Basic Selective Estrogen Receptor Degraders for Endocrine Therapy Resistant Breast Cancer. J Med Chem62:11301-11323 (2019) 
 
Estrogen receptor
Name:Estrogen receptor
Type:Protein
Mol. Mass.:66230.44
Organism:Homo sapiens (Human)
Description:P03372
Residue:595
BDBM50514279
NameBDBM50514279
Synonyms:CHEMBL4527655
TypeSmall organic molecule
Emp. Form.C28H27NO4S
Mol. Mass.473.583
SMILESCC1CN(CCOc2ccc(Oc3c(sc4cc(O)ccc34)C(=O)c3ccccc3C)cc2)C1