Reaction Details
TargetEstrogen receptor
LigandBDBM50514281
Substrate/Competitorn/a
Meas. Tech.ChEMBL_1855954 (CHEMBL4356683)
IC50 1.9±n/a nM
Citation Lu, YGutgesell, LMXiong, RZhao, JLi, YRosales, CIHollas, MShen, ZGordon-Blake, JDye, KWang, YLee, SChen, HHe, DDubrovyskyii, OZhao, HHuang, FLasek, AWTonetti, DAThatcher, GRJ Design and Synthesis of Basic Selective Estrogen Receptor Degraders for Endocrine Therapy Resistant Breast Cancer. J Med Chem62:11301-11323 (2019) 
 
Estrogen receptor
Name:Estrogen receptor
Type:Protein
Mol. Mass.:66230.44
Organism:Homo sapiens (Human)
Description:P03372
Residue:595
BDBM50514281
NameBDBM50514281
Synonyms:CHEMBL4516021
TypeSmall organic molecule
Emp. Form.C27H25NO4S
Mol. Mass.459.557
SMILESCc1ccccc1C(=O)c1sc2cc(O)ccc2c1Oc1ccc(OCCN2CCC2)cc1