Reaction Details
TargetEstrogen receptor
LigandBDBM50514283
Substrate/Competitorn/a
Meas. Tech.ChEMBL_1855954 (CHEMBL4356683)
IC50 1.2±n/a nM
Citation Lu, YGutgesell, LMXiong, RZhao, JLi, YRosales, CIHollas, MShen, ZGordon-Blake, JDye, KWang, YLee, SChen, HHe, DDubrovyskyii, OZhao, HHuang, FLasek, AWTonetti, DAThatcher, GRJ Design and Synthesis of Basic Selective Estrogen Receptor Degraders for Endocrine Therapy Resistant Breast Cancer. J Med Chem62:11301-11323 (2019) 
 
Estrogen receptor
Name:Estrogen receptor
Type:Protein
Mol. Mass.:66230.44
Organism:Homo sapiens (Human)
Description:P03372
Residue:595
BDBM50514283
NameBDBM50514283
Synonyms:CHEMBL4524872
TypeSmall organic molecule
Emp. Form.C27H23F2NO4S
Mol. Mass.495.538
SMILESOc1ccc2c(Oc3ccc(OCCN4CC(CF)C4)cc3)c(sc2c1)C(=O)c1ccc(F)cc1