Reaction Details
TargetEstrogen receptor
LigandBDBM50514284
Substrate/Competitorn/a
Meas. Tech.ChEMBL_1855954 (CHEMBL4356683)
IC50 1.4±n/a nM
Citation Lu, YGutgesell, LMXiong, RZhao, JLi, YRosales, CIHollas, MShen, ZGordon-Blake, JDye, KWang, YLee, SChen, HHe, DDubrovyskyii, OZhao, HHuang, FLasek, AWTonetti, DAThatcher, GRJ Design and Synthesis of Basic Selective Estrogen Receptor Degraders for Endocrine Therapy Resistant Breast Cancer. J Med Chem62:11301-11323 (2019) 
 
Estrogen receptor
Name:Estrogen receptor
Type:Protein
Mol. Mass.:66230.44
Organism:Homo sapiens (Human)
Description:P03372
Residue:595
BDBM50514284
NameBDBM50514284
Synonyms:CHEMBL4483006
TypeSmall organic molecule
Emp. Form.C29H28FNO4S
Mol. Mass.505.6
SMILESCc1ccc(C(=O)c2sc3cc(O)ccc3c2Oc2ccc(OCCN3CC(CF)C3)cc2)c(C)c1