Reaction Details
TargetEstrogen receptor
LigandBDBM50514280
Substrate/Competitorn/a
Meas. Tech.ChEMBL_1855954 (CHEMBL4356683)
IC50 0.707946±n/a nM
Citation Lu, YGutgesell, LMXiong, RZhao, JLi, YRosales, CIHollas, MShen, ZGordon-Blake, JDye, KWang, YLee, SChen, HHe, DDubrovyskyii, OZhao, HHuang, FLasek, AWTonetti, DAThatcher, GRJ Design and Synthesis of Basic Selective Estrogen Receptor Degraders for Endocrine Therapy Resistant Breast Cancer. J Med Chem62:11301-11323 (2019) 
 
Estrogen receptor
Name:Estrogen receptor
Type:Protein
Mol. Mass.:66230.44
Organism:Homo sapiens (Human)
Description:P03372
Residue:595
BDBM50514280
NameBDBM50514280
Synonyms:CHEMBL4586663
TypeSmall organic molecule
Emp. Form.C27H24FNO4S
Mol. Mass.477.547
SMILESOc1ccc2c(Oc3ccc(OC4CN(CCCF)C4)cc3)c(sc2c1)C(=O)c1ccccc1