Reaction Details
TargetEstrogen receptor
LigandBDBM50514287
Substrate/Competitorn/a
Meas. Tech.ChEMBL_1855957 (CHEMBL4356686)
IC50 1.5±n/a nM
Citation Lu, YGutgesell, LMXiong, RZhao, JLi, YRosales, CIHollas, MShen, ZGordon-Blake, JDye, KWang, YLee, SChen, HHe, DDubrovyskyii, OZhao, HHuang, FLasek, AWTonetti, DAThatcher, GRJ Design and Synthesis of Basic Selective Estrogen Receptor Degraders for Endocrine Therapy Resistant Breast Cancer. J Med Chem62:11301-11323 (2019) 
 
Estrogen receptor
Name:Estrogen receptor
Type:Protein
Mol. Mass.:66230.44
Organism:Homo sapiens (Human)
Description:P03372
Residue:595
BDBM50514287
NameBDBM50514287
Synonyms:CHEMBL4532671
TypeSmall organic molecule
Emp. Form.C28H26FNO4S
Mol. Mass.491.574
SMILESCc1ccccc1C(=O)c1sc2cc(O)ccc2c1Oc1ccc(OCCN2CC(CF)C2)cc1