Reaction Details
TargetEstrogen receptor
LigandBDBM50514292
Substrate/Competitorn/a
Meas. Tech.ChEMBL_1855954 (CHEMBL4356683)
IC50 1.0±n/a nM
Citation Lu, YGutgesell, LMXiong, RZhao, JLi, YRosales, CIHollas, MShen, ZGordon-Blake, JDye, KWang, YLee, SChen, HHe, DDubrovyskyii, OZhao, HHuang, FLasek, AWTonetti, DAThatcher, GRJ Design and Synthesis of Basic Selective Estrogen Receptor Degraders for Endocrine Therapy Resistant Breast Cancer. J Med Chem62:11301-11323 (2019) 
 
Estrogen receptor
Name:Estrogen receptor
Type:Protein
Mol. Mass.:66230.44
Organism:Homo sapiens (Human)
Description:P03372
Residue:595
BDBM50514292
NameBDBM50514292
Synonyms:CHEMBL4533964
TypeSmall organic molecule
Emp. Form.C29H27F2NO4S
Mol. Mass.523.591
SMILESCc1cc(F)cc(C)c1C(=O)c1sc2cc(O)ccc2c1Oc1ccc(OC2CN(CCCF)C2)cc1