Reaction Details
TargetLow affinity immunoglobulin epsilon Fc receptor
LigandBDBM50069598
Substrate/Competitorn/a
Meas. Tech.ChEBML_41669
IC50 60±n/a nM
Citation Bailey, SBolognese, BBuckle, DRFaller, AJackson, SLouis-Flamberg, PMcCord, MMayer, RJMarshall, LASmith, DG Selective inhibition of low affinity IgE receptor (CD23) processing. Bioorg Med Chem Lett8:29-34 (1999) Low affinity immunoglobulin epsilon Fc receptor
Name:Low affinity immunoglobulin epsilon Fc receptor
Type:PROTEIN
Mol. Mass.:36461.84
Organism:Homo sapiens (Human)
Description:ChEMBL_88888
Residue:321
BDBM50069598
NameBDBM50069598
Synonyms:(2R,3S)-N*4*-((S)-1-Carbamoyl-2-phenyl-ethyl)-2-{2-(4-chloro-phenyl)-2-[(E)-hydroxyimino]-ethylsulfanylmethyl}-N*1*-hydroxy-3-isobutyl-succinamide | CHEMBL326148
TypeSmall organic molecule
Emp. Form.C26H33ClN4O5S
Mol. Mass.549.082
SMILESCC(C)C[C@H]([C@H](CSCC(N=O)c1ccc(Cl)cc1)C(=O)NO)C(=O)N[C@@H](Cc1ccccc1)C(N)=O