Reaction Details
TargetLow affinity immunoglobulin epsilon Fc receptor
LigandBDBM50069601
Substrate/Competitorn/a
Meas. Tech.ChEBML_41669
IC50 16±n/a nM
Citation Bailey, SBolognese, BBuckle, DRFaller, AJackson, SLouis-Flamberg, PMcCord, MMayer, RJMarshall, LASmith, DG Selective inhibition of low affinity IgE receptor (CD23) processing. Bioorg Med Chem Lett8:29-34 (1999) Low affinity immunoglobulin epsilon Fc receptor
Name:Low affinity immunoglobulin epsilon Fc receptor
Type:PROTEIN
Mol. Mass.:36461.84
Organism:Homo sapiens (Human)
Description:ChEMBL_88888
Residue:321
BDBM50069601
NameBDBM50069601
Synonyms:(2R,3S)-N*4*-Hydroxy-2-isobutyl-N*1*-((S)-1-methylcarbamoyl-2-phenyl-ethyl)-3-(2-oxo-2-phenyl-ethylsulfanylmethyl)-succinamide | CHEMBL324564
TypeSmall organic molecule
Emp. Form.C27H35N3O5S
Mol. Mass.513.649
SMILESCNC(=O)[C@H](Cc1ccccc1)NC(=O)[C@H](CC(C)C)[C@H](CSCC(=O)c1ccccc1)C(=O)NO