Reaction Details
TargetLow affinity immunoglobulin epsilon Fc receptor
LigandBDBM50069597
Substrate/Competitorn/a
Meas. Tech.ChEBML_41669
IC50 30±n/a nM
Citation Bailey, SBolognese, BBuckle, DRFaller, AJackson, SLouis-Flamberg, PMcCord, MMayer, RJMarshall, LASmith, DG Selective inhibition of low affinity IgE receptor (CD23) processing. Bioorg Med Chem Lett8:29-34 (1999) Low affinity immunoglobulin epsilon Fc receptor
Name:Low affinity immunoglobulin epsilon Fc receptor
Type:PROTEIN
Mol. Mass.:36461.84
Organism:Homo sapiens (Human)
Description:ChEMBL_88888
Residue:321
BDBM50069597
NameBDBM50069597
Synonyms:(2R,3S)-N*1*-((S)-1-Carbamoyl-2-phenyl-ethyl)-N*4*-hydroxy-2-isobutyl-3-(thiophen-2-ylsulfanylmethyl)-succinamide | CHEMBL424251
TypeSmall organic molecule
Emp. Form.C22H29N3O4S2
Mol. Mass.463.613
SMILESCC(C)C[C@H]([C@H](CSc1cccs1)C(=O)NO)C(=O)N[C@@H](Cc1ccccc1)C(N)=O