Reaction Details
TargetLow affinity immunoglobulin epsilon Fc receptor
LigandBDBM50069605
Substrate/Competitorn/a
Meas. Tech.ChEMBL_41670 (CHEMBL877262)
IC50 100±n/a nM
Citation Bailey, SBolognese, BBuckle, DRFaller, AJackson, SLouis-Flamberg, PMcCord, MMayer, RJMarshall, LASmith, DG Selective inhibition of low affinity IgE receptor (CD23) processing. Bioorg Med Chem Lett8:29-34 (1999) Low affinity immunoglobulin epsilon Fc receptor
Name:Low affinity immunoglobulin epsilon Fc receptor
Type:PROTEIN
Mol. Mass.:36461.84
Organism:Homo sapiens (Human)
Description:ChEMBL_88888
Residue:321
BDBM50069605
NameBDBM50069605
Synonyms:(2R,3S)-2-Benzyl-N*1*-((S)-1-carbamoyl-2-phenyl-ethyl)-N*4*-hydroxy-3-{2-[(Z)-methoxyimino]-2-phenyl-ethylsulfanylmethyl}-succinamide | CHEMBL115046
TypeSmall organic molecule
Emp. Form.C30H34N4O5S
Mol. Mass.562.68
SMILESCO\N=C(/CSC[C@@H]([C@@H](Cc1ccccc1)C(=O)N[C@@H](Cc1ccccc1)C(N)=O)C(=O)NO)c1ccccc1