Reaction Details
TargetLow affinity immunoglobulin epsilon Fc receptor
LigandBDBM50069607
Substrate/Competitorn/a
Meas. Tech.ChEMBL_41669 (CHEMBL655813)
IC50 100±n/a nM
Citation Bailey, SBolognese, BBuckle, DRFaller, AJackson, SLouis-Flamberg, PMcCord, MMayer, RJMarshall, LASmith, DG Selective inhibition of low affinity IgE receptor (CD23) processing. Bioorg Med Chem Lett8:29-34 (1999) Low affinity immunoglobulin epsilon Fc receptor
Name:Low affinity immunoglobulin epsilon Fc receptor
Type:PROTEIN
Mol. Mass.:36461.84
Organism:Homo sapiens (Human)
Description:ChEMBL_88888
Residue:321
BDBM50069607
NameBDBM50069607
Synonyms:(2R,3S)-2-Carbamoylmethylsulfanylmethyl-N*4*-((S)-1-carbamoyl-2-phenyl-ethyl)-N*1*-hydroxy-3-isobutyl-succinamide | CHEMBL326555
TypeSmall organic molecule
Emp. Form.C20H30N4O5S
Mol. Mass.438.541
SMILESCC(C)C[C@H]([C@H](CSCC(N)=O)C(=O)NO)C(=O)N[C@@H](Cc1ccccc1)C(N)=O