Reaction Details
TargetLow affinity immunoglobulin epsilon Fc receptor
LigandBDBM50031795
Substrate/Competitorn/a
Meas. Tech.ChEMBL_41672 (CHEMBL655815)
IC50 1000±n/a nM
Citation Bailey, SBolognese, BBuckle, DRFaller, AJackson, SLouis-Flamberg, PMcCord, MMayer, RJMarshall, LASmith, DG Selective inhibition of low affinity IgE receptor (CD23) processing. Bioorg Med Chem Lett8:29-34 (1999) Low affinity immunoglobulin epsilon Fc receptor
Name:Low affinity immunoglobulin epsilon Fc receptor
Type:PROTEIN
Mol. Mass.:36461.84
Organism:Homo sapiens (Human)
Description:ChEMBL_88888
Residue:321
BDBM50031795
NameBDBM50031795
Synonyms:(N-(2-HYDROXAMATEMETHYLENE-4-METHYL-PENTOYL)PHENYLALANYL)METHYL AMINE (R)-N4-hydroxy-2-isobutyl-N1-((S)-1-(methylamino)-1-oxo-3-phenylpropan-2-yl)succinamide METHYLAMINO-PHENYLALANYL-LEUCYL-HYDROXAMIC ACID
TypeSmall organic molecule
Emp. Form.C18H27N3O4
Mol. Mass.349.4247
SMILESCNC(=O)[C@H](Cc1ccccc1)NC(=O)[C@H](CC(C)C)CC(=O)NO