Reaction Details
TargetLow affinity immunoglobulin epsilon Fc receptor
LigandBDBM50069610
Substrate/Competitorn/a
Meas. Tech.ChEMBL_41675 (CHEMBL655818)
IC50 40±n/a nM
Citation Bailey, SBolognese, BBuckle, DRFaller, AJackson, SLouis-Flamberg, PMcCord, MMayer, RJMarshall, LASmith, DG Selective inhibition of low affinity IgE receptor (CD23) processing. Bioorg Med Chem Lett8:29-34 (1999) Low affinity immunoglobulin epsilon Fc receptor
Name:Low affinity immunoglobulin epsilon Fc receptor
Type:PROTEIN
Mol. Mass.:36461.84
Organism:Homo sapiens (Human)
Description:ChEMBL_88888
Residue:321
BDBM50069610
NameBDBM50069610
Synonyms:(2R,3S)-N*1*-Hydroxy-2-(4-hydroxy-phenylsulfanylmethyl)-3-isobutyl-N*4*-((S)-1-methylcarbamoyl-2-phenyl-ethyl)-succinamide | CHEMBL114657
TypeSmall organic molecule
Emp. Form.C25H33N3O5S
Mol. Mass.487.612
SMILESCNC(=O)[C@H](Cc1ccccc1)NC(=O)[C@H](CC(C)C)[C@H](CSc1ccc(O)cc1)C(=O)NO