Reaction Details
TargetLow affinity immunoglobulin epsilon Fc receptor
LigandBDBM50069620
Substrate/Competitorn/a
Meas. Tech.ChEBML_41669
IC50 20±n/a nM
Citation Bailey, SBolognese, BBuckle, DRFaller, AJackson, SLouis-Flamberg, PMcCord, MMayer, RJMarshall, LASmith, DG Selective inhibition of low affinity IgE receptor (CD23) processing. Bioorg Med Chem Lett8:29-34 (1999) Low affinity immunoglobulin epsilon Fc receptor
Name:Low affinity immunoglobulin epsilon Fc receptor
Type:PROTEIN
Mol. Mass.:36461.84
Organism:Homo sapiens (Human)
Description:ChEMBL_88888
Residue:321
BDBM50069620
NameBDBM50069620
Synonyms:(2R,3S)-N*1*-((S)-1-Carbamoyl-2-phenyl-ethyl)-N*4*-hydroxy-2-isobutyl-3-(2-oxo-2-phenyl-ethylsulfanylmethyl)-succinamide | CHEMBL115326
TypeSmall organic molecule
Emp. Form.C26H33N3O5S
Mol. Mass.499.622
SMILESCC(C)C[C@H]([C@H](CSCC(=O)c1ccccc1)C(=O)NO)C(=O)N[C@@H](Cc1ccccc1)C(N)=O