Reaction Details
TargetLow affinity immunoglobulin epsilon Fc receptor
LigandBDBM50069621
Substrate/Competitorn/a
Meas. Tech.ChEBML_41669
IC50 80±n/a nM
Citation Bailey, SBolognese, BBuckle, DRFaller, AJackson, SLouis-Flamberg, PMcCord, MMayer, RJMarshall, LASmith, DG Selective inhibition of low affinity IgE receptor (CD23) processing. Bioorg Med Chem Lett8:29-34 (1999) Low affinity immunoglobulin epsilon Fc receptor
Name:Low affinity immunoglobulin epsilon Fc receptor
Type:PROTEIN
Mol. Mass.:36461.84
Organism:Homo sapiens (Human)
Description:ChEMBL_88888
Residue:321
BDBM50069621
NameBDBM50069621
Synonyms:(2R,3S)-N*4*-Hydroxy-2-isobutyl-3-{2-[(E)-methoxyimino]-2-phenyl-ethylsulfanylmethyl}-N*1*-((S)-1-methylcarbamoyl-2-phenyl-ethyl)-succinamide | CHEMBL116506
TypeSmall organic molecule
Emp. Form.C28H38N4O5S
Mol. Mass.542.69
SMILESCNC(=O)[C@H](Cc1ccccc1)NC(=O)[C@H](CC(C)C)[C@H](CSC\C(=N\OC)c1ccccc1)C(=O)NO